{"text_format":"1","workbook":"xlsx","n_sheets":8,"sheets":["Cover","Sources","DataFiles","Systems","NewDataFiles","Log","Seznamy","RFC"],"not_rendered":{"charts":0,"images":0,"macros":1,"external_links":0,"defined_names":2,"comments":0,"pivot_tables":0},"unopened":[],"bounds":{"document_bytes":16777216,"sheet_cells":100000,"rows_first":2000,"rows_last":500,"rows_between":2000,"halvings":0,"cell_chars":16384,"cell_head_chars":4096},"cells_cut":0,"cells_raw":0,"read":"whole","date_system":"1900"}

{"sheet":"Cover","index":0,"n_rows":427,"n_cols":135,"rows_kept":427,"cut":false,"hidden":false,"merged":[[424,32,424,35],[425,32,425,35],[426,32,426,35],[419,32,419,35],[420,32,420,35],[421,32,421,35],[422,32,422,35],[423,32,423,35],[414,32,414,35],[415,32,415,35],[416,32,416,35],[417,32,417,35],[418,32,418,35],[409,32,409,35],[410,32,410,35],[411,32,411,35],[412,32,412,35],[413,32,413,35],[404,32,404,35],[405,32,405,35],[406,32,406,35],[407,32,407,35],[408,32,408,35],[399,32,399,35],[400,32,400,35],[401,32,401,35],[402,32,402,35],[403,32,403,35],[394,32,394,35],[395,32,395,35],[396,32,396,35],[397,32,397,35],[398,32,398,35],[389,32,389,35],[390,32,390,35],[391,32,391,35],[392,32,392,35],[393,32,393,35],[384,32,384,35],[385,32,385,35],[386,32,386,35],[387,32,387,35],[388,32,388,35],[379,32,379,35],[380,32,380,35],[381,32,381,35],[382,32,382,35],[383,32,383,35],[374,32,374,35],[375,32,375,35],[376,32,376,35],[377,32,377,35],[378,32,378,35],[369,32,369,35],[370,32,370,35],[371,32,371,35],[372,32,372,35],[373,32,373,35],[364,32,364,35],[365,32,365,35],[366,32,366,35],[367,32,367,35],[368,32,368,35],[359,32,359,35],[360,32,360,35],[361,32,361,35],[362,32,362,35],[363,32,363,35],[354,32,354,35],[355,32,355,35],[356,32,356,35],[357,32,357,35],[358,32,358,35],[349,32,349,35],[350,32,350,35],[351,32,351,35],[352,32,352,35],[353,32,353,35],[344,32,344,35],[345,32,345,35],[346,32,346,35],[347,32,347,35],[348,32,348,35],[339,32,339,35],[340,32,340,35],[341,32,341,35],[342,32,342,35],[343,32,343,35],[334,32,334,35],[335,32,335,35],[336,32,336,35],[337,32,337,35],[338,32,338,35],[329,32,329,35],[330,32,330,35],[331,32,331,35],[332,32,332,35],[333,32,333,35],[324,32,324,35],[325,32,325,35],[326,32,326,35],[327,32,327,35],[328,32,328,35],[319,32,319,35],[320,32,320,35],[321,32,321,35],[322,32,322,35],[323,32,323,35],[314,32,314,35],[315,32,315,35],[316,32,316,35],[317,32,317,35],[318,32,318,35],[309,32,309,35],[310,32,310,35],[311,32,311,35],[312,32,312,35],[313,32,313,35],[304,32,304,35],[305,32,305,35],[306,32,306,35],[307,32,307,35],[308,32,308,35],[299,32,299,35],[300,32,300,35],[301,32,301,35],[302,32,302,35],[303,32,303,35],[294,32,294,35],[295,32,295,35],[296,32,296,35],[297,32,297,35],[298,32,298,35],[289,32,289,35],[290,32,290,35],[291,32,291,35],[292,32,292,35],[293,32,293,35],[284,32,284,35],[285,32,285,35],[286,32,286,35],[287,32,287,35],[288,32,288,35],[279,32,279,35],[280,32,280,35],[281,32,281,35],[282,32,282,35],[283,32,283,35],[274,32,274,35],[275,32,275,35],[276,32,276,35],[277,32,277,35],[278,32,278,35],[269,32,269,35],[270,32,270,35],[271,32,271,35],[272,32,272,35],[273,32,273,35],[264,32,264,35],[265,32,265,35],[266,32,266,35],[267,32,267,35],[268,32,268,35],[259,32,259,35],[260,32,260,35],[261,32,261,35],[262,32,262,35],[263,32,263,35],[254,32,254,35],[255,32,255,35],[256,32,256,35],[257,32,257,35],[258,32,258,35],[249,32,249,35],[250,32,250,35],[251,32,251,35],[252,32,252,35],[253,32,253,35],[244,32,244,35],[245,32,245,35],[246,32,246,35],[247,32,247,35],[248,32,248,35],[239,32,239,35],[240,32,240,35],[241,32,241,35],[242,32,242,35],[243,32,243,35],[234,32,234,35],[235,32,235,35],[236,32,236,35],[237,32,237,35],[238,32,238,35],[229,32,229,35],[230,32,230,35],[231,32,231,35],[232,32,232,35],[233,32,233,35],[224,32,224,35],[225,32,225,35],[226,32,226,35],[227,32,227,35],[228,32,228,35],[219,32,219,35],[220,32,220,35],[221,32,221,35],[222,32,222,35],[223,32,223,35],[214,32,214,35],[215,32,215,35],[216,32,216,35],[217,32,217,35],[218,32,218,35],[209,32,209,35],[210,32,210,35],[211,32,211,35],[212,32,212,35],[213,32,213,35],[204,32,204,35],[205,32,205,35],[206,32,206,35],[207,32,207,35],[208,32,208,35],[199,32,199,35],[200,32,200,35],[201,32,201,35],[202,32,202,35],[203,32,203,35],[194,32,194,35],[195,32,195,35],[196,32,196,35],[197,32,197,35],[198,32,198,35],[189,32,189,35],[190,32,190,35],[191,32,191,35],[192,32,192,35],[193,32,193,35],[184,32,184,35],[185,32,185,35],[186,32,186,35],[187,32,187,35],[188,32,188,35],[179,32,179,35],[180,32,180,35],[181,32,181,35],[182,32,182,35],[183,32,183,35],[174,32,174,35],[175,32,175,35],[176,32,176,35],[177,32,177,35],[178,32,178,35],[169,32,169,35],[170,32,170,35],[171,32,171,35],[172,32,172,35],[173,32,173,35],[164,32,164,35],[165,32,165,35],[166,32,166,35],[167,32,167,35],[168,32,168,35],[159,32,159,35],[160,32,160,35],[161,32,161,35],[162,32,162,35],[163,32,163,35],[154,32,154,35],[155,32,155,35],[156,32,156,35],[157,32,157,35],[158,32,158,35],[149,32,149,35],[150,32,150,35],[151,32,151,35],[152,32,152,35],[153,32,153,35],[144,32,144,35],[145,32,145,35],[146,32,146,35],[147,32,147,35],[148,32,148,35],[139,32,139,35],[140,32,140,35],[141,32,141,35],[142,32,142,35],[143,32,143,35],[134,32,134,35],[135,32,135,35],[136,32,136,35],[137,32,137,35],[138,32,138,35],[129,32,129,35],[130,32,130,35],[131,32,131,35],[132,32,132,35],[133,32,133,35],[124,32,124,35],[125,32,125,35],[126,32,126,35],[127,32,127,35],[128,32,128,35],[119,32,119,35],[120,32,120,35],[121,32,121,35],[122,32,122,35],[123,32,123,35],[114,32,114,35],[115,32,115,35],[116,32,116,35],[117,32,117,35],[118,32,118,35],[109,32,109,35],[110,32,110,35],[111,32,111,35],[112,32,112,35],[113,32,113,35],[104,32,104,35],[105,32,105,35],[106,32,106,35],[107,32,107,35],[108,32,108,35],[99,32,99,35],[100,32,100,35],[101,32,101,35],[102,32,102,35],[103,32,103,35],[94,32,94,35],[95,32,95,35],[96,32,96,35],[97,32,97,35],[98,32,98,35],[90,32,90,35],[91,32,91,35],[92,32,92,35],[93,32,93,35],[84,32,84,35],[85,32,85,35],[86,32,86,35],[87,32,87,35],[88,32,88,35],[81,32,81,35],[82,32,82,35],[83,32,83,35],[74,32,74,35],[75,32,75,35],[76,32,76,35],[77,32,77,35],[78,32,78,35],[89,32,89,35],[72,32,72,35],[73,32,73,35],[64,32,64,35],[65,32,65,35],[66,32,66,35],[67,32,67,35],[68,32,68,35],[79,32,79,35],[80,32,80,35],[63,32,63,35],[54,32,54,35],[55,32,55,35],[56,32,56,35],[57,32,57,35],[58,32,58,35],[69,32,69,35],[70,32,70,35],[71,32,71,35],[48,4,48,7],[48,9,48,12],[48,14,48,17],[48,19,48,22],[48,24,48,27],[59,32,59,35],[60,32,60,35],[61,32,61,35],[62,32,62,35],[51,32,51,35],[52,32,52,35],[53,32,53,35],[4,14,4,17],[4,19,4,22],[4,24,4,27],[27,4,27,7],[27,9,27,12],[27,14,27,17],[27,19,27,22],[27,24,27,27],[25,24,25,27],[46,4,46,7],[46,9,46,12],[46,14,46,17],[46,19,46,22],[46,24,46,27],[33,32,33,35],[34,32,34,35],[35,32,35,35],[45,32,45,35],[46,32,46,35],[2,44,2,47],[4,44,4,47],[25,44,25,47],[46,44,46,47],[2,39,2,42],[4,39,4,42],[25,39,25,42],[46,39,46,42],[2,4,2,7],[2,9,2,12],[2,14,2,17],[2,19,2,22],[2,24,2,27],[25,4,25,7],[25,9,25,12],[25,14,25,17],[25,19,25,22],[4,4,4,7],[4,9,4,12],[2,29,2,37],[5,32,5,35],[7,32,7,35],[8,32,8,35],[9,32,9,35],[2,54,2,57],[4,54,4,57],[25,54,25,57],[46,54,46,57],[2,49,2,52],[4,49,4,52],[25,49,25,52],[46,49,46,52],[2,64,2,67],[4,64,4,67],[25,64,25,67],[46,64,46,67],[2,59,2,62],[4,59,4,62],[25,59,25,62],[46,59,46,62],[2,74,2,77],[4,74,4,77],[25,74,25,77],[46,74,46,77],[2,69,2,72],[4,69,4,72],[25,69,25,72],[46,69,46,72],[2,84,2,87],[4,84,4,87],[25,84,25,87],[46,84,46,87],[2,79,2,82],[4,79,4,82],[25,79,25,82],[46,79,46,82],[2,94,2,97],[4,94,4,97],[25,94,25,97],[46,94,46,97],[2,89,2,92],[4,89,4,92],[25,89,25,92],[46,89,46,92],[2,104,2,107],[4,104,4,107],[25,104,25,107],[46,104,46,107],[2,99,2,102],[4,99,4,102],[25,99,25,102],[46,99,46,102],[10,32,10,35],[11,32,11,35],[12,32,12,35],[13,32,13,35],[28,32,28,35],[29,32,29,35],[30,32,30,35],[31,32,31,35],[32,32,32,35],[23,32,23,35],[24,32,24,35],[25,32,25,35],[26,32,26,35],[27,32,27,35],[14,32,14,35],[15,32,15,35],[16,32,16,35],[17,32,17,35],[18,32,18,35],[19,32,19,35],[20,32,20,35],[21,32,21,35],[22,32,22,35],[47,32,47,35],[48,32,48,35],[49,32,49,35],[50,32,50,35],[36,32,36,35],[37,32,37,35],[38,32,38,35],[39,32,39,35],[40,32,40,35],[41,32,41,35],[42,32,42,35],[43,32,43,35],[44,32,44,35]]}
[]
[null,null,null,null,{"$f":"E3","v":"Portál"},null,null,null,null,{"$f":"J3","v":"Stavební úřad"},null,null,null,null,{"$f":"O3","v":"Požárníci"},null,null,null,null,{"$f":"T3","v":"Památkáři"},null,null,null,null,{"$f":"Y3","v":"Ochrana přírody"},null,null,null,null,null,null,null,null,null,null,null,null,null,null,{"$f":"AN3","v":"Sousedé"},null,null,null,null,{"$f":"AS3","v":"Operátoři"},null,null,null,null,{"$f":"AX3","v":"Ministerstvo ŽP"},null,null,null,null,{"$f":"BC3","v":"Soud"},null,null,null,null,{"$f":"BH3","v":"Investor"},null,null,null,null,{"$f":"BM3","v":"Další dotčené orgány"},null,null,null,null,{"$f":"BR3","v":"Majitel stavající infrasturktury"},null,null,null,null,{"$f":"BW3","v":"Obec"},null,null,null,null,{"$f":"CB3","v":"Poskytovatel dotace"},null,null,null,null,{"$f":"CG3","v":"Stavební firma"},null,null,null,null,{"$f":"CL3","v":"Další systém 16"},null,null,null,null,{"$f":"CQ3","v":"Další systém 17"},null,null,null,null,{"$f":"CV3","v":"Další systém 18"},null,null,null,null,{"$f":"DA3","v":"Další systém 19"}]
[null,null,null,null,{"$f":"Sources!$C3","v":"Portál"},null,null,null,null,{"$f":"Sources!$C9","v":"Stavební úřad"},null,null,null,null,{"$f":"Sources!$C10","v":"Požárníci"},null,null,null,null,{"$f":"Sources!$C11","v":"Památkáři"},null,null,null,null,{"$f":"Sources!$C12","v":"Ochrana přírody"},null,null,null,null,{"$f":"DA3","v":"Další systém 19"},null,null,null,null,null,null,null,null,null,{"$f":"Sources!$C13","v":"Sousedé"},null,null,null,null,{"$f":"Sources!$C14","v":"Operátoři"},null,null,null,null,{"$f":"Sources!$C15","v":"Ministerstvo ŽP"},null,null,null,null,{"$f":"Sources!$C16","v":"Soud"},null,null,null,null,{"$f":"Sources!$C17","v":"Investor"},null,null,null,null,{"$f":"Sources!$C18","v":"Další dotčené orgány"},null,null,null,null,{"$f":"Sources!$C19","v":"Majitel stavající infrasturktury"},null,null,null,null,{"$f":"Sources!$C20","v":"Obec"},null,null,null,null,{"$f":"Sources!$C21","v":"Poskytovatel dotace"},null,null,null,null,{"$f":"Sources!$C22","v":"Stavební firma"},null,null,null,null,{"$f":"Sources!$C23","v":"Další systém 16"},null,null,null,null,{"$f":"Sources!$C24","v":"Další systém 17"},null,null,null,null,{"$f":"Sources!$C25","v":"Další systém 18"},null,null,null,null,{"$f":"Sources!$C26","v":"Další systém 19"}]
[]
[null,null,null,null,{"$f":"COUNT(E8:E24)","v":0},null,null,null,null,{"$f":"COUNT(J8:J24)","v":2},null,null,null,null,{"$f":"COUNT(O8:O24)","v":0},null,null,null,null,{"$f":"COUNT(T8:T24)","v":0},null,null,null,null,{"$f":"COUNT(Y8:Y24)","v":1},null,null,null,null,null,null,null,null,null,null,null,null,null,null,{"$f":"COUNT(AN8:AN33)","v":1},null,null,null,null,{"$f":"COUNT(AS8:AS33)","v":0},null,null,null,null,{"$f":"COUNT(AX8:AX33)","v":0},null,null,null,null,{"$f":"COUNT(BC8:BC33)","v":0},null,null,null,null,{"$f":"COUNT(BH8:BH33)","v":0},null,null,null,null,{"$f":"COUNT(BM8:BM33)","v":1},null,null,null,null,{"$f":"COUNT(BR8:BR33)","v":0},null,null,null,null,{"$f":"COUNT(BW8:BW33)","v":0},null,null,null,null,{"$f":"COUNT(CB8:CB33)","v":0},null,null,null,null,{"$f":"COUNT(CG8:CG33)","v":0},null,null,null,null,{"$f":"COUNT(CL8:CL33)","v":0},null,null,null,null,{"$f":"COUNT(CQ8:CQ33)","v":0},null,null,null,null,{"$f":"COUNT(CV8:CV33)","v":0},null,null,null,null,{"$f":"COUNT(DA8:DA33)","v":0},null,null,null,null,"DataFiles",null,null,null,null,null,null,null,null,null,null,null,null,null,null,null,null,"NewDataFiles"]
[null,null,null,null,"ID","Name","FileType","TimeStamp",null,"ID","Name","FileType","TimeStamp",null,"ID","Name","FileType","TimeStamp",null,"ID","Name","FileType","TimeStamp",null,"ID","Name","FileType","TimeStamp",null,"ID","Name","FileType","Current Systém",null,null,null,"Content","TimeStamp",null,"ID","Name","FileType","TimeStamp",null,"ID","Name","FileType","TimeStamp",null,"ID","Name","Current Systém","FileType",null,"ID","Name","Current Systém","FileType",null,"ID","Name","Current Systém","FileType",null,"ID","Name","Current Systém","FileType",null,"ID","Name","Current Systém","FileType",null,"ID","Name","Current Systém","FileType",null,"ID","Name","Current Systém","FileType",null,"ID","Name","Current Systém","FileType",null,"ID","Name","Current Systém","FileType",null,"ID","Name","Current Systém","FileType",null,"ID","Name","Current Systém","FileType",null,"ID","Name","Current Systém","FileType",null,{"$f":"DataFiles!A1","v":"FileID"},{"$f":"DataFiles!B1","v":"FileName"},{"$f":"DataFiles!C1","v":"FileType"},{"$f":"DataFiles!D1","v":"CurrentSystem"},{"$f":"DataFiles!E1","v":"NextSystem"},{"$f":"DataFiles!F1","v":"What was done in this trigger step:"},{"$f":"DataFiles!G1","v":"Počet"},{"$f":"DataFiles!H1","v":"TimeStamp"},{"$f":"DataFiles!I1","v":"B"},{"$f":"DataFiles!J1","v":0},{"$f":"DataFiles!K1","v":0},null,null,null,null,null,null,"FileID","FileName","FileType","CurrentSystem","NextSystem","Content","Count","TimeStamp","Počet"]
{"$rows_left_out":422}
{"sheet":"Sources","index":1,"n_rows":28,"n_cols":10,"rows_kept":28,"cut":false,"hidden":false,"merged":[]}
[]
["No.","Capacity","Systém"]
[3,1,{"$f":"Seznamy!C2","v":"Portál"}]
[null,null,"     FileID",2,3,4,5,6,7,1]
[null,null,"     FileName","žádost","žádost","žádost","žádost","žádost","žádost","žádost"]
[null,null,"     FileType","Povolení záměru","Povolení záměru","Povolení záměru","Povolení záměru","Povolení záměru","Povolení záměru","Povolení záměru"]
{"$rows_left_out":23}
{"sheet":"DataFiles","index":2,"n_rows":6,"n_cols":9,"rows_kept":6,"cut":false,"hidden":false,"merged":[]}
["FileID","FileName","FileType","CurrentSystem","NextSystem","What was done in this trigger step:","Počet","TimeStamp","B"]
[1,"žádost","Schváleno PO","Stavební úřad",null,"The application number 1 is resolved",1,45848.348330787034]
[1,"žádost","Schváleno Pam","Stavební úřad",null,"The application number 1 is resolved",1,45848.348338194446]
[1,"žádost","Posouzení záměru OP","Ochrana přírody",null,"The application number 1 is resolved",1,45848.347627314812]
[1,"žádost","Posouzení záměru Sous","Sousedé",null,"The application number 1 is resolved",1,45848.347630324075]
[1,"žádost","Posouzení záměru DDO","Další dotčené orgány",null,"The response to the application number 1 has been returned to the building office.",1,45848.347633217592]
{"$rows_left_out":1}
{"sheet":"Systems","index":3,"n_rows":35,"n_cols":62,"rows_kept":35,"cut":false,"hidden":false,"merged":[]}
["FileID","FileName","FileType","CurrentSystem","NextSystem","Content","Počet","TimeStamp","Aktuální pracnost",null,null,null,null,null,null,null,null,null,null,null,null,null,null,null,null,null,"SystemID","SystemName","FileType","Formula","IF","Delay","NextFileTypePlus","NextFileTypeMinus","NextSystemPlus","NextSystemMinus","What was done in this trigger step:","ContentMinus","StringPlus","StringMinus","EventPlus","EventMinus",null,"Capacity","Počet",null,null,null,null,null,null,null,"NewFileID","NewFileName","NewFileType","NewSystems","NewNextSystem","NewContent",0,"TimeStamp","Pracnost plánovaná","Pracnost aktuální"]
[1,"žádost","Posouzení záměru DDO","Další dotčené orgány",null,"as well as is ready for comments from other relevant authorities.",5,45848.347633217592,null,null,null,null,null,null,null,null,null,null,null,null,null,null,null,null,null,null,"N","Portál","Povolení záměru",null,null,null,"Posouzení záměru SÚ",null,"Stavební úřad",null,{"$f":"\"The request number \"&A2&\" has been forwarded to the building office.\"","v":"The request number 1 has been forwarded to the building office."},null,null,null,null,null,null,{"$f":"_xlfn.XLOOKUP(AB2,Seznamy!C$2:C$100,Seznamy!D$2:D$100,\"\")","v":10},{"$f":"_xlfn.XLOOKUP(AI2,Seznamy!C$2:C$100,Seznamy!E$2:E$100,\"\")","v":0},null,null,null,null,null,null,null,{"$f":"IF(AND($C2=$AC2,$D2=$AB2),$A2,\"\")","v":""},{"$f":"IF($BA2=\"\",\"\",B2)","v":""},{"$f":"IF($BA2=\"\",\"\",IF($AS2<=$AR2,$AG2,$C2))","v":""},{"$f":"IF($BA2=\"\",\"\",IF($AS2<=$AR2,$AI2,$D2))","v":""},{"$f":"IF(BA2=\"\",\"\",IF(E2=\"\",\"\",E2))","v":""},{"$f":"IF($BA2=\"\",\"\",IF($AE2=\"\",$AK2,$AL2))","v":""},{"$f":"IF(BA2=\"\",BG1,1+BG1)","v":0},{"$f":"IF($BA2=\"\",\"\",IF(BD2=D2,H2,NOW()))","v":""},{"$f":"_xlfn.XLOOKUP(BC2,Seznamy!A:A,Seznamy!B:B,\"\")","v":""}]
[{"$f":"A2","v":1},"žádost","Posouzení záměru DDO","Další dotčené orgány",0,"as well as is ready for comments from other relevant authorities.",5,45848.347633217592,null,null,null,null,null,null,null,null,null,null,null,null,null,null,null,null,null,null,1,"Portál","Žádost o koladaci",null,null,null,"Příprava kolaudace",null,"Stavební úřad",null,{"$f":"\"The request number \"&A3&\" has been forwarded to the building office.\"","v":"The request number 1 has been forwarded to the building office."},null,null,null,null,null,null,{"$f":"_xlfn.XLOOKUP(AB3,Seznamy!C$2:C$100,Seznamy!D$2:D$100,\"\")","v":10},{"$f":"_xlfn.XLOOKUP(AI3,Seznamy!C$2:C$100,Seznamy!E$2:E$100,\"\")","v":0}]
[1,"žádost","Posouzení záměru DDO","Další dotčené orgány",0,"as well as is ready for comments from other relevant authorities.",5,45848.347633217592,null,null,null,null,null,null,null,null,null,null,null,null,null,null,null,null,null,null,1,"Portál","Žádost o povolení užívání",null,null,null,"Příprava povolení užívání",null,"Stavební úřad",null,{"$f":"\"The request number \"&A4&\" has been forwarded to the building office.\"","v":"The request number 1 has been forwarded to the building office."},null,null,null,null,null,null,{"$f":"_xlfn.XLOOKUP(AB4,Seznamy!C$2:C$100,Seznamy!D$2:D$100,\"\")","v":10},{"$f":"_xlfn.XLOOKUP(AI4,Seznamy!C$2:C$100,Seznamy!E$2:E$100,\"\")","v":0}]
[{"$f":"A2","v":1},{"$f":"B2","v":"žádost"},{"$f":"C2","v":"Posouzení záměru DDO"},{"$f":"D2","v":"Další dotčené orgány"},null,{"$f":"F2","v":"as well as is ready for comments from other relevant authorities."},{"$f":"G2","v":5},{"$f":"H2","v":45848.347633217592},null,null,null,null,null,null,null,null,null,null,null,null,null,null,null,null,null,null,1,"Portál","Uzavřeno",null,null,null,"Uzavřeno",null,"Investor",null,{"$f":"\"The request number \"&A5&\" has been completed and delivered to the investor.\"","v":"The request number 1 has been completed and delivered to the investor."},null,null,null,null,null,null,{"$f":"_xlfn.XLOOKUP(AB5,Seznamy!C$2:C$100,Seznamy!D$2:D$100,\"\")","v":10},{"$f":"_xlfn.XLOOKUP(AI5,Seznamy!C$2:C$100,Seznamy!E$2:E$100,\"\")","v":0},null,null,null,null,null,null,null,{"$f":"IF(AND($C5=$AC5,$D5=$AB5,A5<>\"\"),$A5,\"\")","v":""},"",{"$f":"IF($BA5=\"\",\"\",IF($AS5<=$AR5,$AG5,$C5))","v":""},{"$f":"IF($BA5=\"\",\"\",IF($AS5<=$AR5,$AI5,$D5))","v":""},{"$f":"IF(BA5=\"\",\"\",IF(E5=\"\",\"\",E5))","v":""},"",{"$f":"IF(BA5=\"\",BG2,1+BG2)","v":0},"",{"$f":"_xlfn.XLOOKUP(BC5,Seznamy!A:A,Seznamy!B:B,\"\")","v":""}]
[{"$f":"A5","v":1},{"$f":"B5","v":"žádost"},{"$f":"C5","v":"Posouzení záměru DDO"},{"$f":"D5","v":"Další dotčené orgány"},null,{"$f":"F5","v":"as well as is ready for comments from other relevant authorities."},{"$f":"G5","v":5},{"$f":"H5","v":45848.347633217592},0,null,null,null,null,null,null,null,null,null,null,null,null,null,null,null,null,null,2,"Stavební úřad","Posouzení záměru SÚ",null,null,null,"Posouzení záměru PO",null,"Požárníci",null,{"$f":"\"The application number \"&A6&\" has been submitted for review by the fire department.\"","v":"The application number 1 has been submitted for review by the fire department."},null,null,null,null,null,null,{"$f":"_xlfn.XLOOKUP(AB6,Seznamy!C$2:C$100,Seznamy!D$2:D$100,\"\")","v":4},{"$f":"_xlfn.XLOOKUP(AI6,Seznamy!C$2:C$100,Seznamy!E$2:E$100,\"\")","v":0},null,null,null,null,null,null,null,"","","","","","",0,"",{"$f":"_xlfn.XLOOKUP(BC6,Seznamy!A:A,Seznamy!B:B,\"\")","v":""}]
{"$rows_left_out":30}
{"sheet":"NewDataFiles","index":4,"n_rows":33,"n_cols":17,"rows_kept":33,"cut":false,"hidden":false,"merged":[]}
["FileID","FileName","FileType","CurrentSystem","NextSystem","Content","Count","TimeStamp",{"$f":"Seznamy!C$2","v":"Portál"},{"$f":"Seznamy!C$3","v":"Stavební úřad"},{"$f":"Seznamy!C$4","v":"Požárníci"},{"$f":"Seznamy!C$5","v":"Památkáři"},{"$f":"Seznamy!C$6","v":"Ochrana přírody"},{"$f":"Seznamy!C$7","v":"Sousedé"},{"$f":"Seznamy!C$8","v":"Operátoři"},{"$f":"Seznamy!C$9","v":"Ministerstvo ŽP"},{"$f":"Seznamy!C$10","v":"Soud"}]
[null,null,null,null,null,null,null,null,{"$f":"IF(I$1=$D2,1,0)","v":0},0,0,0,0,0,0,0,0]
[null,null,null,null,null,null,null,null,0,0,0,0,0,0,0,0,0]
[null,null,null,null,null,null,null,null,0,0,0,0,0,0,0,0,0]
[null,null,null,null,null,null,null,null,0,0,0,0,0,0,0,0,0]
[null,null,null,null,null,null,null,null,{"$f":"IF(I$1=$D6,1,0)","v":0},0,0,0,0,0,0,0,0]
{"$rows_left_out":28}
{"sheet":"Log","index":5,"n_rows":12,"n_cols":8,"rows_kept":12,"cut":false,"hidden":false,"merged":[]}
["FileID","FileName","FileType","CurrentSystem","NextSystem","Content","Počet","TimeStamp"]
[1,"žádost","Posouzení záměru SÚ","Stavební úřad",null,"The request number 1 has been forwarded to the building office.",1,45848.347500925927]
[1,"žádost","Posouzení záměru PO","Požárníci",null,"The application number 1 has been submitted for review by the fire department.",1,45848.347623263886]
[1,"žádost","Posouzení záměru Pam","Památkáři",null,"and to review by the heritage authorities.",2,45848.347623263886]
[1,"žádost","Posouzení záměru OP","Ochrana přírody",null,"and for review by the nature conservation authority",3,45848.347623263886]
[1,"žádost","Posouzení záměru Sous","Sousedé",null,"and is ready for comments from the neighbors.",4,45848.347623263886]
{"$rows_left_out":7}
{"sheet":"Seznamy","index":6,"n_rows":26,"n_cols":6,"rows_kept":26,"cut":false,"hidden":false,"merged":[]}
["FileType","Pracnost","Systems","Capacity","Aktuální kapacita","FileTypes in Systems"]
["Povolení záměru",1,"Portál",10,{"$f":"SUM(NewDataFiles!I$2:I$33)","v":0}]
["Posouzení záměru SÚ",1,"Stavební úřad",4,{"$f":"SUM(NewDataFiles!J$2:J$33)","v":0}]
["Posouzení záměru PO",1,"Požárníci",2,{"$f":"SUM(NewDataFiles!K$2:K$33)","v":0}]
["Posouzení záměru Pam",1,"Památkáři",1,{"$f":"SUM(NewDataFiles!L$2:L$33)","v":0}]
["Posouzení záměru OP",1,"Ochrana přírody",1,{"$f":"SUM(NewDataFiles!M$2:M$33)","v":0}]
{"$rows_left_out":21}
{"sheet":"RFC","index":7,"n_rows":95,"n_cols":2,"rows_kept":95,"cut":false,"hidden":false,"merged":[]}
["Funkční Requirement ID","Description"]
[null,"Data:"]
[1,"VBA Makra pracují s listy DataFiles, NewDataFiles, Systems, Log a jejich jednotlivými poli, jak jsou popsána dále"]
["1a","Všechna pole na každém listu jsou definována na řádku číslo 1 daného listu."]
[2,"List DataFiles obsahuje tato pole:"]
["2a","FileID - je identifikátor datového souboru"]
{"$rows_left_out":89}